{"text_format":"1","workbook":"xlsx","n_sheets":8,"sheets":["Druckverlust","Optipress","Optiflex-Profix","Optiflex-Flowpress","Optiflex-Press","Optiarmatur","Dimensionen","Medien"],"not_rendered":{"charts":0,"images":38,"macros":1,"external_links":0,"defined_names":20,"comments":0,"pivot_tables":0},"unopened":[],"bounds":{"document_bytes":16777216,"sheet_cells":100000,"rows_first":2000,"rows_last":500,"rows_between":2000,"halvings":0,"cell_chars":16384,"cell_head_chars":4096},"cells_cut":0,"cells_raw":0,"read":"whole","date_system":"1900"}

{"sheet":"Druckverlust","index":0,"n_rows":25,"n_cols":8,"rows_kept":25,"cut":false,"hidden":false,"merged":[[24,1,24,5],[20,1,20,5],[0,2,1,4]]}
[null,null,"Volume"]
[]
[null,null,"u","v"]
[null,"N°","Dim-","Longueur","Matériau","Diamètre","Volume d'eau","Volume"]
[null,"SP","Nr.",null,"du tuyau","de conduite","par mètre","par ségment"]
[null,"[-]","[-]","[m]","[-]","[mm]","[l/m]","[l]"]
[null,1,null,null,{"$f":"IF(C7=\"\",\"\",VLOOKUP($C7,Dimensionen!$B$3:$G$21,5))","v":""},{"$f":"IF(E7=\"\",\"\",VLOOKUP($C7,Dimensionen!$B$3:$G$21,2))","v":""},{"$f":"IF(F7=\"\",\"\",VLOOKUP($C7,Dimensionen!$B$3:$G$21,6))","v":""},{"$f":"IF(F7=\"\",\"\",G7*D7)","v":""}]
[null,2,null,null,{"$f":"IF(C8=\"\",\"\",VLOOKUP($C8,Dimensionen!$B$3:$G$21,5))","v":""},{"$f":"IF(E8=\"\",\"\",VLOOKUP($C8,Dimensionen!$B$3:$G$21,2))","v":""},{"$f":"IF(F8=\"\",\"\",VLOOKUP($C8,Dimensionen!$B$3:$G$21,6))","v":""},{"$f":"IF(F8=\"\",\"\",G8*D8)","v":""}]
[null,3,null,null,{"$f":"IF(C9=\"\",\"\",VLOOKUP($C9,Dimensionen!$B$3:$G$21,5))","v":""},{"$f":"IF(E9=\"\",\"\",VLOOKUP($C9,Dimensionen!$B$3:$G$21,2))","v":""},{"$f":"IF(F9=\"\",\"\",VLOOKUP($C9,Dimensionen!$B$3:$G$21,6))","v":""},""]
[" ",4,null,null,{"$f":"IF(C10=\"\",\"\",VLOOKUP($C10,Dimensionen!$B$3:$G$21,5))","v":""},{"$f":"IF(E10=\"\",\"\",VLOOKUP($C10,Dimensionen!$B$3:$G$21,2))","v":""},{"$f":"IF(F10=\"\",\"\",VLOOKUP($C10,Dimensionen!$B$3:$G$21,6))","v":""},""]
{"$rows_left_out":16}
{"sheet":"Optipress","index":1,"n_rows":88,"n_cols":108,"rows_kept":88,"cut":false,"hidden":false,"merged":[[83,1,83,5],[49,1,59,1],[49,2,59,2],[49,3,59,3],[60,1,64,1],[60,2,64,2],[60,3,64,3],[1,4,3,4],[1,5,3,5],[16,1,26,1],[16,2,26,2],[16,3,26,3],[5,1,15,1],[5,2,15,2],[5,3,15,3],[1,1,3,1],[1,2,3,2],[1,3,3,3],[27,107,37,107],[79,1,82,1],[79,2,82,2],[79,3,82,3],[65,1,71,1],[65,2,71,2],[65,3,71,3],[72,1,78,1],[72,2,78,2],[72,3,78,3],[27,1,48,1],[27,2,37,2],[27,3,37,3],[38,2,48,2],[38,3,48,3]]}
[]
[null,"Nr.","Symbol","Bezeichnung","d","z","TS","TS","TS","TS","TS","TS","TS","TS","TS","TS","TS","TS","TS","TS","TS","TS","TS","TS","TS","TS","TS","TS","TS","TS","TS","TS","TS","TS","TS","TS","TS","TS","TS","TS","TS","TS","TS","TS","TS","TS","TS","TS","TS","TS","TS","TS","TS","TS","TS","TS"]
[null,null,null,null,null,null,1,2,3,4,5,6,7,8,9,10,11,12,13,14,15,16,17,18,19,20,21,22,23,24,25,26,27,28,29,30,31,32,33,34,35,36,37,38,39,40,41,42,43,44,45,46,47,48,49,50]
[null,null,null,null,null,null,"Stk","Stk","Stk","Stk","Stk","Stk","Stk","Stk","Stk","Stk","Stk","Stk","Stk","Stk","Stk","Stk","Stk","Stk","Stk","Stk","Stk","Stk","Stk","Stk","Stk","Stk","Stk","Stk","Stk","Stk","Stk","Stk","Stk","Stk","Stk","Stk","Stk","Stk","Stk","Stk","Stk","Stk","Stk","Stk","Stk","Stk","Stk","Stk","Stk","Stk"]
[null,null,null,"Zeta-Total Optipress",null,null,{"$f":"G84","v":0},{"$f":"H84","v":0},0,0,0,0,0,0,0,0,0,0,0,0,0,0,0,0,0,{"$f":"Z84","v":0},{"$f":"AA84","v":0},0,0,0,0,0,0,0,0,0,0,0,0,0,0,0,0,0,0,0,0,0,0,0,0,0,0,0,0,0]
[null,80000,null,"Optipress-Aquaplus-Bogen 90°",15,0.8,null,null,null,null,null,null,null,null,null,null,null,null,null,null,null,null,null,null,null,null,null,null,null,null,null,null,null,null,null,null,null,null,null,null,null,null,null,null,null,null,null,null,null,null,null,null,null,null,null,null,null,{"$f":"$F6*G6","v":0},{"$f":"$F6*H6","v":0},{"$f":"$F6*I6","v":0},{"$f":"$F6*J6","v":0},{"$f":"$F6*K6","v":0},{"$f":"$F6*L6","v":0},{"$f":"$F6*M6","v":0},{"$f":"$F6*N6","v":0},{"$f":"$F6*O6","v":0},{"$f":"$F6*P6","v":0},{"$f":"$F6*Q6","v":0},{"$f":"$F6*R6","v":0},{"$f":"$F6*S6","v":0},{"$f":"$F6*T6","v":0},{"$f":"$F6*U6","v":0},{"$f":"$F6*V6","v":0},{"$f":"$F6*W6","v":0},{"$f":"$F6*X6","v":0},{"$f":"$F6*Y6","v":0},{"$f":"$F6*Z6","v":0},{"$f":"$F6*AA6","v":0},{"$f":"$F6*AB6","v":0},{"$f":"$F6*AC6","v":0},{"$f":"$F6*AD6","v":0},{"$f":"$F6*AE6","v":0},{"$f":"$F6*AF6","v":0},{"$f":"$F6*AG6","v":0},{"$f":"$F6*AH6","v":0},{"$f":"$F6*AI6","v":0},{"$f":"$F6*AJ6","v":0},{"$f":"$F6*AK6","v":0},{"$f":"$F6*AL6","v":0},{"$f":"$F6*AM6","v":0},{"$f":"$F6*AN6","v":0},{"$f":"$F6*AO6","v":0},{"$f":"$F6*AP6","v":0},{"$f":"$F6*AQ6","v":0},{"$f":"$F6*AR6","v":0},{"$f":"$F6*AS6","v":0},{"$f":"$F6*AT6","v":0},{"$f":"$F6*AU6","v":0},{"$f":"$F6*AV6","v":0},{"$f":"$F6*AW6","v":0},{"$f":"$F6*AX6","v":0},{"$f":"$F6*AY6","v":0},{"$f":"$F6*AZ6","v":0},{"$f":"$F6*BA6","v":0},{"$f":"$F6*BB6","v":0},{"$f":"$F6*BC6","v":0},{"$f":"$F6*BD6","v":0}]
[null,null,null,null,18,0.5,null,null,null,null,null,null,null,null,null,null,null,null,null,null,null,null,null,null,null,null,null,null,null,null,null,null,null,null,null,null,null,null,null,null,null,null,null,null,null,null,null,null,null,null,null,null,null,null,null,null,null,0,0,0,0,0,0,0,0,0,0,0,0,0,0,0,0,0,0,0,0,0,0,0,0,0,0,0,0,0,0,0,0,0,0,0,0,0,0,0,0,0,0,0,0,0,0,0,0,0,0]
[null,null,null,null,22,0.3,null,null,null,null,null,null,null,null,null,null,null,null,null,null,null,null,null,null,null,null,null,null,null,null,null,null,null,null,null,null,null,null,null,null,null,null,null,null,null,null,null,null,null,null,null,null,null,null,null,null,null,0,0,0,0,0,0,0,0,0,0,0,0,0,0,0,0,0,0,0,0,0,0,0,0,0,0,0,0,0,0,0,0,0,0,0,0,0,0,0,0,0,0,0,0,0,0,0,0,0,0]
[null,null,null,null,28,0.4,null,null,null,null,null,null,null,null,null,null,null,null,null,null,null,null,null,null,null,null,null,null,null,null,null,null,null,null,null,null,null,null,null,null,null,null,null,null,null,null,null,null,null,null,null,null,null,null,null,null,null,0,0,0,0,0,0,0,0,0,0,0,0,0,0,0,0,0,0,0,0,0,0,0,0,0,0,0,0,0,0,0,0,0,0,0,0,0,0,0,0,0,0,0,0,0,0,0,0,0,0]
[null,null,null,null,35,0.2,null,null,null,null,null,null,null,null,null,null,null,null,null,null,null,null,null,null,null,null,null,null,null,null,null,null,null,null,null,null,null,null,null,null,null,null,null,null,null,null,null,null,null,null,null,null,null,null,null,null,null,0,0,0,0,0,0,0,0,0,0,0,0,0,0,0,0,0,0,0,0,0,0,0,0,0,0,0,0,0,0,0,0,0,0,0,0,0,0,0,0,0,0,0,0,0,0,0,0,0,0]
{"$rows_left_out":79}
{"sheet":"Optiflex-Profix","index":2,"n_rows":46,"n_cols":108,"rows_kept":46,"cut":false,"hidden":false,"merged":[[10,3,12,3],[24,1,26,1],[24,2,26,2],[24,3,26,3],[41,1,41,5],[27,1,32,1],[27,2,29,2],[27,3,29,3],[30,2,32,2],[30,3,32,3],[38,1,40,1],[38,2,40,2],[38,3,40,3],[33,1,37,1],[33,2,37,2],[33,3,37,3],[27,107,37,107],[5,1,6,1],[5,2,6,2],[5,3,6,3],[13,1,17,1],[13,2,17,2],[13,3,17,3],[18,1,23,1],[18,2,20,2],[18,3,20,3],[21,2,23,2],[21,3,23,3],[7,1,12,1],[7,2,9,2],[7,3,9,3],[10,2,12,2],[1,5,3,5],[1,4,3,4],[1,3,3,3],[1,2,3,2],[1,1,3,1]]}
[]
[null,"Nr.","Symbol","Bezeichnung","d","z","TS","TS","TS","TS","TS","TS","TS","TS","TS","TS","TS","TS","TS","TS","TS","TS","TS","TS","TS","TS","TS","TS","TS","TS","TS","TS","TS","TS","TS","TS","TS","TS","TS","TS","TS","TS","TS","TS","TS","TS","TS","TS","TS","TS","TS","TS","TS","TS","TS","TS"]
[null,null,null,null,null,null,1,2,3,4,5,6,7,8,9,10,11,12,13,14,15,16,17,18,19,20,21,22,23,24,25,26,27,28,29,30,31,32,33,34,35,36,37,38,39,40,41,42,43,44,45,46,47,48,49,50]
[null,null,null,null,null,null,"Stk.","Stk.","Stk.","Stk.","Stk.","Stk.","Stk.","Stk.","Stk.","Stk.","Stk.","Stk.","Stk.","Stk.","Stk.","Stk.","Stk.","Stk.","Stk.","Stk.","Stk","Stk","Stk","Stk","Stk","Stk","Stk","Stk","Stk","Stk","Stk","Stk","Stk","Stk","Stk","Stk","Stk","Stk","Stk","Stk","Stk","Stk","Stk","Stk","Stk","Stk","Stk","Stk","Stk","Stk"]
[null,null,null,"Zeta-Total Optiflex-Profix",null,null,{"$f":"G42","v":0},{"$f":"H42","v":0},0,0,0,0,0,0,0,0,0,0,0,0,0,0,0,0,0,0,0,0,0,0,0,0,0,0,0,0,0,0,0,0,0,0,0,0,0,0,0,0,0,{"$f":"AX42","v":0},0,0,0,0,0,0]
[null,"85100\n85105 ",null,"Optiflex-Profix-Dose 90° ","½ x 16",1.4,null,null,null,null,null,null,null,null,null,null,null,null,null,null,null,null,null,null,null,null,null,null,null,null,null,null,null,null,null,null,null,null,null,null,null,null,null,null,null,null,null,null,null,null,null,null,null,null,null,null,null,{"$f":"$F6*G6","v":0},0,0,0,0,0,0,0,0,0,0,0,0,0,0,0,0,0,0,0,{"$f":"$F6*AA6","v":0},0,0,0,0,0,0,0,0,0,0,0,0,0,0,0,0,0,0,0,0,0,0,{"$f":"$F6*AX6","v":0},0,0,0,0,0,0]
[null,null,null,null,"½ x 20",1.4,null,null,null,null,null,null,null,null,null,null,null,null,null,null,null,null,null,null,null,null,null,null,null,null,null,null,null,null,null,null,null,null,null,null,null,null,null,null,null,null,null,null,null,null,null,null,null,null,null,null,null,{"$f":"$F7*G7","v":0},{"$f":"$F7*H7","v":0},0,0,0,0,0,0,0,0,0,{"$f":"$F7*R7","v":0},0,0,0,0,0,0,0,0,0,0,0,0,0,0,0,0,0,0,0,0,0,0,0,0,0,0,0,0,0,0,0,0,0,0,0,0,0,0]
[null,"85110\n85111","Durchfluss","Optiflex-Profix-Doppeldose 90°","½ x 16 x 16",1.2,null,null,null,null,null,null,null,null,null,null,null,null,null,null,null,null,null,null,null,null,null,null,null,null,null,null,null,null,null,null,null,null,null,null,null,null,null,null,null,null,null,null,null,null,null,null,null,null,null,null,null,0,0,0,0,0,0,0,0,0,0,0,0,0,0,0,0,0,0,0,0,0,0,0,0,0,0,0,0,0,0,0,0,0,0,0,0,0,0,0,0,0,0,0,0,0,0,0,0,0,0]
[null,null,null,null,"½ x 20 x 16",1.3,null,null,null,null,null,null,null,null,null,null,null,null,null,null,null,null,null,null,null,null,null,null,null,null,null,null,null,null,null,null,null,null,null,null,null,null,null,null,null,null,null,null,null,null,null,null,null,null,null,null,null,0,0,0,0,0,0,0,0,0,0,0,0,0,0,0,0,0,0,0,0,0,0,0,0,0,0,0,0,0,0,0,0,0,0,0,0,0,0,0,0,0,0,{"$f":"$F9*AW9","v":0},0,0,0,0,0,0,0]
[null,null,null,null,"½ x 20 x 20",1.4,null,null,null,null,null,null,null,null,null,null,null,null,null,null,null,null,null,null,null,null,null,null,null,null,null,null,null,null,null,null,null,null,null,null,null,null,null,null,null,null,null,null,null,null,null,null,null,null,null,null,null,0,{"$f":"$F10*H10","v":0},{"$f":"$F10*I10","v":0},{"$f":"$F10*J10","v":0},{"$f":"$F10*K10","v":0},{"$f":"$F10*L10","v":0},{"$f":"$F10*M10","v":0},{"$f":"$F10*N10","v":0},{"$f":"$F10*O10","v":0},{"$f":"$F10*P10","v":0},{"$f":"$F10*Q10","v":0},{"$f":"$F10*R10","v":0},{"$f":"$F10*S10","v":0},{"$f":"$F10*T10","v":0},{"$f":"$F10*U10","v":0},{"$f":"$F10*V10","v":0},{"$f":"$F10*W10","v":0},{"$f":"$F10*X10","v":0},{"$f":"$F10*Y10","v":0},{"$f":"$F10*Z10","v":0},{"$f":"$F10*AA10","v":0},{"$f":"$F10*AB10","v":0},{"$f":"$F10*AC10","v":0},{"$f":"$F10*AD10","v":0},{"$f":"$F10*AE10","v":0},{"$f":"$F10*AF10","v":0},{"$f":"$F10*AG10","v":0},{"$f":"$F10*AH10","v":0},{"$f":"$F10*AI10","v":0},{"$f":"$F10*AJ10","v":0},{"$f":"$F10*AK10","v":0},{"$f":"$F10*AL10","v":0},{"$f":"$F10*AM10","v":0},{"$f":"$F10*AN10","v":0},{"$f":"$F10*AO10","v":0},{"$f":"$F10*AP10","v":0},{"$f":"$F10*AQ10","v":0},{"$f":"$F10*AR10","v":0},{"$f":"$F10*AS10","v":0},{"$f":"$F10*AT10","v":0},{"$f":"$F10*AU10","v":0},{"$f":"$F10*AV10","v":0},0,0,0,0,0,0,0,0]
{"$rows_left_out":37}
{"sheet":"Optiflex-Flowpress","index":3,"n_rows":68,"n_cols":108,"rows_kept":68,"cut":false,"hidden":false,"merged":[[5,1,6,1],[5,2,6,2],[5,3,6,3],[1,1,3,1],[1,2,3,2],[1,3,3,3],[1,4,3,4],[1,5,3,5],[26,1,32,1],[26,2,32,2],[26,3,32,3],[7,1,12,1],[7,2,9,2],[7,3,9,3],[10,2,12,2],[10,3,12,3],[13,1,19,1],[13,2,19,2],[13,3,19,3],[20,1,25,1],[20,2,22,2],[20,3,22,3],[23,2,25,2],[23,3,25,3],[33,107,59,107],[40,2,46,2],[40,3,46,3],[63,1,63,5],[33,1,46,1],[33,2,39,2],[33,3,39,3],[47,1,59,1],[47,2,59,2],[47,3,59,3],[60,1,62,1],[60,2,62,2],[60,3,62,3]]}
[]
[null,"Nr.","Symbol","Bezeichnung","d","z","TS","TS","TS","TS","TS","TS","TS","TS","TS","TS","TS","TS","TS","TS","TS","TS","TS","TS","TS","TS","TS","TS","TS","TS","TS","TS","TS","TS","TS","TS","TS","TS","TS","TS","TS","TS","TS","TS","TS","TS","TS","TS","TS","TS","TS","TS","TS","TS","TS","TS"]
[null,null,null,null,null,null,1,2,3,4,5,6,7,8,9,10,11,12,13,14,15,16,17,18,19,20,21,22,23,24,25,26,27,28,29,30,31,32,33,34,35,36,37,38,39,40,41,42,43,44,45,46,47,48,49,50]
[null,null,null,null,null,null,"Stk.","Stk.","Stk.","Stk.","Stk.","Stk.","Stk.","Stk.","Stk.","Stk.","Stk.","Stk.","Stk.","Stk.","Stk.","Stk.","Stk.","Stk.","Stk.","Stk.","Stk","Stk","Stk","Stk","Stk","Stk","Stk","Stk","Stk","Stk","Stk","Stk","Stk","Stk","Stk","Stk","Stk","Stk","Stk","Stk","Stk","Stk","Stk","Stk","Stk","Stk","Stk","Stk","Stk","Stk"]
[null,null,null,"Zeta-Total Optiflex-Flowpress",null,null,{"$f":"G64","v":0},{"$f":"H64","v":0},0,0,0,0,0,0,0,0,0,0,0,0,0,0,0,0,0,0,0,0,0,0,0,0,0,0,0,0,0,0,0,0,0,0,0,0,0,0,0,0,0,0,0,0,0,0,0,0]
[null,"84200\n84205",null,"Optiflex-Flow-press-Dose 90° ","½ x 16",4,null,null,null,null,null,null,null,null,null,null,null,null,null,null,null,null,null,null,null,null,null,null,null,null,null,null,null,null,null,null,null,null,null,null,null,null,null,null,null,null,null,null,null,null,null,null,null,null,null,null,null,{"$f":"$F6*G6","v":0},0,0,0,0,0,0,0,0,0,0,0,0,0,0,0,{"$f":"$F6*W6","v":0},0,0,0,0,0,0,0,0,0,0,0,0,0,0,0,{"$f":"$F6*AM6","v":0},0,0,0,0,0,0,0,0,0,0,0,0,0,0,0,{"$f":"$F6*BC6","v":0},0]
[null,null,null,null,"½ x 20",2.9,null,null,null,null,null,null,null,null,null,null,null,null,null,null,null,null,null,null,null,null,null,null,null,null,null,null,null,null,null,null,null,null,null,null,null,null,null,null,null,null,null,null,null,null,null,null,null,null,null,null,null,0,0,0,0,0,0,0,0,0,0,0,0,0,0,0,0,0,0,0,0,0,0,0,0,0,0,0,0,0,0,0,0,0,0,0,0,0,0,0,0,0,0,0,0,0,0,0,0,0,0]
[null,"84210\n84211","Durchfluss","Optiflex-Flowpress-Doppeldose 90°","½ x 16 x 16",2.4,null,null,null,null,null,null,null,null,null,null,null,null,null,null,null,null,null,null,null,null,null,null,null,null,null,null,null,null,null,null,null,null,null,null,null,null,null,null,null,null,null,null,null,null,null,null,null,null,null,null,null,0,0,0,0,0,0,0,0,0,0,0,0,0,0,0,0,0,0,0,0,0,0,0,0,0,0,0,0,0,0,0,0,0,0,0,0,0,0,0,0,0,0,0,0,0,0,0,0,0,0]
[null,null,null,null,"½ x 20 x 16",2.4,null,null,null,null,null,null,null,null,null,null,null,null,null,null,null,null,null,null,null,null,null,null,null,null,null,null,null,null,null,null,null,null,null,null,null,null,null,null,null,null,null,null,null,null,null,null,null,null,null,null,null,0,0,0,0,0,0,0,0,0,0,0,0,0,0,0,0,0,0,0,0,0,0,0,0,0,0,0,0,0,0,0,0,0,0,0,0,0,0,0,0,0,0,0,0,0,0,0,0,0,0]
[null,null,null,null,"½ x 20 x 20",2.7,null,null,null,null,null,null,null,null,null,null,null,null,null,null,null,null,null,null,null,null,null,null,null,null,null,null,null,null,null,null,null,null,null,null,null,null,null,null,null,null,null,null,null,null,null,null,null,null,null,null,null,0,0,0,0,0,0,0,0,0,0,0,0,0,0,0,0,0,0,0,0,0,0,0,0,0,0,0,0,0,0,0,0,0,0,0,0,0,0,0,0,0,0,0,0,0,0,0,0,0,0]
{"$rows_left_out":59}
{"sheet":"Optiflex-Press","index":4,"n_rows":43,"n_cols":108,"rows_kept":43,"cut":false,"hidden":false,"merged":[[18,1,21,1],[18,2,19,2],[18,3,19,3],[20,2,21,2],[38,1,38,5],[25,1,30,1],[25,2,27,2],[25,3,27,3],[28,2,30,2],[28,3,30,3],[36,1,37,1],[36,2,37,2],[36,3,37,3],[31,1,35,1],[31,2,35,2],[31,3,35,3],[25,107,35,107],[20,3,21,3],[5,1,6,1],[5,2,6,2],[5,3,6,3],[22,1,24,1],[22,2,24,2],[22,3,24,3],[7,1,12,1],[7,2,9,2],[7,3,9,3],[10,2,12,2],[10,3,12,3],[13,1,17,1],[13,2,17,2],[13,3,17,3],[1,5,3,5],[1,4,3,4],[1,3,3,3],[1,2,3,2],[1,1,3,1]]}
[]
[null,"Nr.","Symbol","Bezeichnung","d","z","TS","TS","TS","TS","TS","TS","TS","TS","TS","TS","TS","TS","TS","TS","TS","TS","TS","TS","TS","TS","TS","TS","TS","TS","TS","TS","TS","TS","TS","TS","TS","TS","TS","TS","TS","TS","TS","TS","TS","TS","TS","TS","TS","TS","TS","TS","TS","TS","TS","TS"]
[null,null,null,null,null,null,1,2,3,4,5,6,7,8,9,10,11,12,13,14,15,16,17,18,19,20,21,22,23,24,25,26,27,28,29,30,31,32,33,34,35,36,37,38,39,40,41,42,43,44,45,46,47,48,49,50]
[null,null,null,null,null,null,"Stk","Stk","Stk","Stk","Stk","Stk","Stk","Stk","Stk","Stk","Stk","Stk","Stk","Stk","Stk","Stk","Stk","Stk","Stk","Stk","Stk","Stk","Stk","Stk","Stk","Stk","Stk","Stk","Stk","Stk","Stk","Stk","Stk","Stk","Stk","Stk","Stk","Stk","Stk","Stk","Stk","Stk","Stk","Stk","Stk","Stk","Stk","Stk","Stk","Stk"]
[null,null,null,"Zeta-Total Optiflex-Press",null,null,{"$f":"G39","v":0},{"$f":"H39","v":0},0,0,0,0,0,0,0,0,0,0,0,0,0,0,0,0,0,0,0,0,0,0,0,0,0,0,0,0,0,0,0,0,0,0,0,0,0,0,0,0,0,0,0,0,0,0,0,0]
[null,"84110 84111",null,"Optiflex-Press-Dose 90° ","½ x 16",5.6,null,null,null,null,null,null,null,null,null,null,null,null,null,null,null,null,null,null,null,null,null,null,null,null,null,null,null,null,null,null,null,null,null,null,null,null,null,null,null,null,null,null,null,null,null,null,null,null,null,null,null,{"$f":"$F6*G6","v":0},0,0,0,0,0,0,0,0,0,0,0,0,0,0,0,0,0,0,0,{"$f":"$F6*AA6","v":0},0,0,0,0,0,0,0,0,0,0,0,0,0,0,0,{"$f":"$F6*AQ6","v":0},0,0,0,0,0,0,0,0,0,0,0,0,0]
[null,null,null,null,"½ x 20",3.3,null,null,null,null,null,null,null,null,null,null,null,null,null,null,null,null,null,null,null,null,null,null,null,null,null,null,null,null,null,null,null,null,null,null,null,null,null,null,null,null,null,null,null,null,null,null,null,null,null,null,null,{"$f":"$F7*G7","v":0},{"$f":"$F7*H7","v":0},0,0,0,0,0,0,0,0,0,{"$f":"$F7*R7","v":0},0,0,0,0,0,0,0,0,0,0,0,0,0,0,0,0,0,0,0,0,0,0,0,0,0,0,0,0,0,0,0,0,0,0,0,0,0,0]
[null,84117,"Durchfluss","Optiflex-Press-Doppeldose 90°","½ x 16 x 16",5.5,null,null,null,null,null,null,null,null,null,null,null,null,null,null,null,null,null,null,null,null,null,null,null,null,null,null,null,null,null,null,null,null,null,null,null,null,null,null,null,null,null,null,null,null,null,null,null,null,null,null,null,0,0,0,0,0,0,0,0,0,0,0,0,0,0,0,0,0,0,0,0,0,0,0,0,0,0,0,0,0,0,0,0,0,0,0,0,0,0,0,0,0,0,0,0,0,0,0,0,0,0]
[null,null,null,null,"½ x 20 x 16",3.4,null,null,null,null,null,null,null,null,null,null,null,null,null,null,null,null,null,null,null,null,null,null,null,null,null,null,null,null,null,null,null,null,null,null,null,null,null,null,null,null,null,null,null,null,null,null,null,null,null,null,null,0,0,0,0,0,0,0,0,0,0,0,0,0,0,0,0,0,0,0,0,0,0,0,0,0,0,0,0,0,0,0,0,0,0,0,0,0,0,0,0,0,0,0,0,0,0,0,0,0,0]
[null,null,null,null,"½ x 20 x 20",3.5,null,null,null,null,null,null,null,null,null,null,null,null,null,null,null,null,null,null,null,null,null,null,null,null,null,null,null,null,null,null,null,null,null,null,null,null,null,null,null,null,null,null,null,null,null,null,null,null,null,null,null,0,0,0,0,0,0,0,0,0,0,0,0,0,0,0,0,{"$f":"$F10*W10","v":0},0,0,0,0,0,0,0,0,0,0,0,0,0,0,0,0,0,0,0,0,0,0,0,0,0,0,0,0,0,0,0,0,0]
{"$rows_left_out":34}
{"sheet":"Optiarmatur","index":5,"n_rows":39,"n_cols":107,"rows_kept":39,"cut":false,"hidden":false,"merged":[[5,1,11,1],[5,2,11,2],[5,3,11,3],[34,1,34,5],[12,1,21,1],[12,2,21,2],[12,3,21,3],[22,1,28,1],[22,2,28,2],[22,3,28,3],[29,1,31,1],[29,2,31,2],[29,3,31,3],[1,5,3,5],[1,4,3,4],[1,3,3,3],[1,2,3,2],[1,1,3,1]]}
[]
[null,"Nr.","Symbol","Bezeichnung","d","z","TS","TS","TS","TS","TS","TS","TS","TS","TS","TS","TS","TS","TS","TS","TS","TS","TS","TS","TS","TS","TS","TS","TS","TS","TS","TS","TS","TS","TS","TS","TS","TS","TS","TS","TS","TS","TS","TS","TS","TS","TS","TS","TS","TS","TS","TS","TS","TS","TS","TS"]
[null,null,null,null,null,null,1,2,3,4,5,6,7,8,9,10,11,12,13,14,15,16,17,18,19,20,21,22,23,24,25,26,27,28,29,30,31,32,33,34,35,36,37,38,39,40,41,42,43,44,45,46,47,48,49,50]
[null,null,null,null,null,null,"Stk","Stk","Stk","Stk","Stk","Stk","Stk","Stk","Stk","Stk","Stk","Stk","Stk","Stk","Stk","Stk","Stk","Stk","Stk","Stk","Stk","Stk","Stk","Stk","Stk","Stk","Stk","Stk","Stk","Stk","Stk","Stk","Stk","Stk","Stk","Stk","Stk","Stk","Stk","Stk","Stk","Stk","Stk","Stk","Stk","Stk","Stk","Stk","Stk","Stk"]
[null,null,null,"Zeta-Total Optiarmatur",null,null,{"$f":"G35","v":0},0,0,0,0,0,0,0,0,0,0,0,0,0,0,0,0,0,0,0,{"$f":"AA35","v":0},0,0,0,0,0,0,0,0,0,0,0,0,0,0,0,0,0,0,0,0,0,0,0,0,0,0,0,0,0]
[null,"22100 22102",null,"Schrägsitz-ventil",0.5,2,null,null,null,null,null,null,null,null,null,null,null,null,null,null,null,null,null,null,null,null,null,null,null,null,null,null,null,null,null,null,null,null,null,null,null,null,null,null,null,null,null,null,null,null,null,null,null,null,null,null,null,{"$f":"$F6*G6","v":0},0,0,0,0,0,0,0,0,0,0,0,0,0,0,0,0,0,0,0,{"$f":"$F6*AA6","v":0},0,0,0,0,0,0,0,0,0,0,0,0,0,0,0,{"$f":"$F6*AQ6","v":0},0,0,0,0,0,0,0,0,0,0,0,0,0]
[null,null,null,null,0.75,1.7,null,null,null,null,null,null,null,null,null,null,null,null,null,null,null,null,null,null,null,null,null,null,null,null,null,null,null,null,null,null,null,null,null,null,null,null,null,null,null,null,null,null,null,null,null,null,null,null,null,null,null,{"$f":"$F7*G7","v":0},{"$f":"$F7*H7","v":0},0,0,0,0,0,0,0,0,0,{"$f":"$F7*R7","v":0},0,0,0,0,0,0,0,0,0,0,0,0,0,0,0,0,0,0,0,0,0,0,0,0,0,0,0,0,0,0,0,0,0,0,0,0,0,0]
[null,null,null,null,1,1.4,null,null,null,null,null,null,null,null,null,null,null,null,null,null,null,null,null,null,null,null,null,null,null,null,null,null,null,null,null,null,null,null,null,null,null,null,null,null,null,null,null,null,null,null,null,null,null,null,null,null,null,0,0,0,0,0,0,0,0,0,0,0,0,0,0,0,0,0,0,0,0,0,0,0,0,0,0,0,0,0,0,0,0,0,0,0,0,0,0,0,0,0,0,0,0,0,0,0,0,0,0]
[null,null,null,null,1.25,1.2,null,null,null,null,null,null,null,null,null,null,null,null,null,null,null,null,null,null,null,null,null,null,null,null,null,null,null,null,null,null,null,null,null,null,null,null,null,null,null,null,null,null,null,null,null,null,null,null,null,null,null,0,0,0,0,0,0,0,0,0,0,0,0,0,0,0,0,0,0,0,0,0,0,0,0,0,0,0,0,0,0,0,0,0,0,0,0,0,0,0,0,0,0,0,0,0,0,0,0,0,0]
[null,null,null,null,1.5,1.6,null,null,null,null,null,null,null,null,null,null,null,null,null,null,null,null,null,null,null,null,null,null,null,null,null,null,null,null,null,null,null,null,null,null,null,null,null,null,null,null,null,null,null,null,null,null,null,null,null,null,null,0,0,0,0,0,0,0,0,0,0,0,0,0,0,0,0,{"$f":"$F10*W10","v":0},0,0,0,0,0,0,0,0,0,0,0,0,0,0,0,0,0,0,0,0,0,0,0,0,0,0,0,0,0,0,0,0,0]
{"$rows_left_out":30}
{"sheet":"Dimensionen","index":6,"n_rows":21,"n_cols":7,"rows_kept":21,"cut":false,"hidden":true,"merged":[]}
[null,"Nummer","Durchmesser","Innendurchmesser","Rohrrauhigkeit","Bezeichnung","Volumen pro Meter [l/m]"]
[]
["Optipress",1.0149999999999999," 15x1.0",13,1.5E-3,"Optipress-Rohr",{"$f":"(D3/2)^2*3.1415927/1000","v":0.13273229157499999}]
[null,1.018,"18x1.0",16,1.5E-3,"Optipress-Rohr",{"$f":"(D4/2)^2*3.1415927/1000","v":0.20106193279999998}]
[null,1.022," 22x1.2",19.600000000000001,1.5E-3,"Optipress-Rohr",0.30171856290800009]
[null,1.028," 28x1.2",25.6,1.5E-3,"Optipress-Rohr",0.5147185479680001]
[null,1.0349999999999999," 35x1.5",32,1.5E-3,"Optipress-Rohr",0.80424773119999993]
[null,1.042," 42x1.5",39,1.5E-3,"Optipress-Rohr",1.1945906241749999]
[null,1.054," 54x1.5",51,1.5E-3,"Optipress-Rohr",2.0428206531750002]
[null,1.0640000000000001,"64x2.0",60,1.5E-3,"Optipress-Rohr",2.8274334300000001]
{"$rows_left_out":12}
{"sheet":"Medien","index":7,"n_rows":12,"n_cols":3,"rows_kept":12,"cut":false,"hidden":true,"merged":[]}
["Wasser"]
["Temperatur","Dichte","Viskosität"]
["[°C]","[kg/m3]","[m2/s]"]
[10,999.7,1.3069999999999999E-6]
[20,998.2,1.0038E-6]
[30,995.67,8.0100000000000004E-7]
[40,992.24,6.5799999999999999E-7]
[50,988.07,5.5400000000000001E-7]
[60,983.24,4.75E-7]
[70,977.81,4.1300000000000001E-7]
{"$rows_left_out":2}